{"text_format":"1","workbook":"xlsx","n_sheets":11,"sheets":["Base","Entrada","Ejemplo","Categoria 1","Categoria 2","Categoria 3","Categoria 4","Categoria 5","Categoria 6","Categoria 7","Categoria 8"],"not_rendered":{"charts":9,"images":1,"macros":1,"external_links":1,"defined_names":0,"comments":1,"pivot_tables":0},"unopened":[],"bounds":{"document_bytes":16777216,"sheet_cells":100000,"rows_first":2000,"rows_last":500,"rows_between":2000,"halvings":0,"cell_chars":16384,"cell_head_chars":4096},"cells_cut":0,"cells_raw":0,"read":"whole","date_system":"1900"}

{"sheet":"Base","index":0,"n_rows":12,"n_cols":9,"rows_kept":12,"cut":false,"hidden":true,"merged":[]}
["Categoría animal"]
["Mamones Macho procedentes de vacas lecheras",346,null,null,"Validación entrada",{"$f":"DATE(B12-1,1,1)","v":"2024-01-01"},{"$f":"F2","v":45292},{"$f":"DATE(B12,12,31)","v":"2025-12-31"},{"$f":"H2","v":46022}]
["Mamones Hembra procedentes de vacas lecheras",337,null,null,"Validación salida",{"$f":"DATE(B12,1,1)","v":"2025-01-01"},{"$f":"F3","v":45658},{"$f":"DATE(B12+1,12,31)","v":"2026-12-31"},{"$f":"H3","v":46387}]
["Mamones Macho procedentes de vacas nodriza",346]
["Mamones Hembra procedentes de vacas nodriza",337]
["Pasteros Macho procedentes de vacas nodriza",185]
["Pasteros Hembra procedentes de vacas nodriza",165]
["Hembras adultas de descarte o desvieje"]
{"$rows_left_out":5}
{"sheet":"Entrada","index":1,"n_rows":28,"n_cols":12,"rows_kept":28,"cut":false,"hidden":false,"merged":[[1,4,3,7],[27,1,28,5],[14,2,14,7],[4,2,4,5],[16,2,16,7],[18,2,25,7],[5,1,6,7]]}
[]
[null,null,null,null,"Archivo para agrupar lotes de vacuno de cebo, según categoría productiva"]
[]
[]
[null,null,"Indique el año de declaración: ",null,null,null,2025]
[null,{"$f":"\"(En cada año n se hace la declaración del año n - 1. Por ejemplo, en el año \"&L6&\" se debe indicar que el año de declaración es el \"&L7&\")\"","v":"(En cada año n se hace la declaración del año n - 1. Por ejemplo, en el año 2026 se debe indicar que el año de declaración es el 2025)"},null,null,null,null,null,null,null,null,null,{"$f":"YEAR(TODAY())","v":2026}]
[null,null,null,null,null,null,null,null,null,null,null,{"$f":"L6-1","v":2025}]
[]
{"$rows_left_out":21}
{"sheet":"Ejemplo","index":2,"n_rows":160,"n_cols":45,"rows_kept":160,"cut":false,"hidden":false,"merged":[[7,1,7,8],[7,12,7,24],[0,1,0,3],[0,18,0,23],[2,0,2,2],[2,3,2,8],[5,1,5,8],[4,13,4,17],[0,14,0,17]]}
[null,"Año de declaración: ",null,null,null,{"$f":"Base!B12","v":2025},null,null,null,null,null,null,null,null,"Datos a grabar en el paso 2 de ECOGAN",null,null,null,"Datos a grabar en el paso 4 de ECOGAN"]
[null,null,null,null,null,null,null,null,null,null,null,null,null,null,null,null,"nº total de animales que entran de esta categoría productiva:",{"$f":"AE160","v":125},null,null,null,null,"Periodo productivo total medio de la categoría productiva:",{"$f":"H4","v":350}]
["Categoría productiva: ",null,null,"Mamones Macho procedentes de vacas lecheras",null,null,null,null,null,null,null,null,null,null,null,null,"nº total de animales vivos que finalizan de esta categoría productiva:",{"$f":"AF160","v":122},null,null,null,null,"días medios presentes de la categoría productiva:",{"$f":"AR160","v":242}]
[null,null,null,null,null,"Indique el periodo productivo medio de la categoría productiva (días):",null,350,"*"]
[null,null,null,null,null,"Periodo productivo medio de referencia (días):",null,{"$f":"IFERROR(VLOOKUP(D3,Base!A2:B7,2,FALSE),\"sin dato\")","v":346},{"$f":"IF(H5=\"sin dato\",\"\",\"(\"&ROUND(H5*0.9,0) &\" - \"&ROUND(H5*1.1,0)&\")\")","v":"(311 - 381)"},null,null,null,null,"Si desea borrar datos grabados anteriormente, pulse aquí\n¡Cuidado! Perderá toda la información"]
["*","Número de días que por término medio los animales de una linea productiva permanecen en la granja desde que entran hasta que salen de ese alojamiento, de modo que el periodo es por ciclo productivo y no por año natural. "]
[null,null,null,null,null,null,null,null,null,null,null,null,{"$f":"Base!F2","v":45292},{"$f":"Base!H3","v":46387}]
["u","Lote es el grupo de animales que van entrando de forma escalonada a los corrales.",null,null,null,null,null,null,null,null,null,null,"Diagrama de entradas y salidas"]
{"$rows_left_out":153}
{"sheet":"Categoria 1","index":3,"n_rows":160,"n_cols":45,"rows_kept":160,"cut":false,"hidden":false,"merged":[[7,1,7,8],[7,12,7,24],[4,13,4,17],[0,1,0,3],[2,0,2,2],[2,3,2,8],[5,1,5,8],[0,12,0,17],[0,18,0,23]]}
[null,"Año de declaración: ",null,null,null,{"$f":"Base!B12","v":2025},null,null,null,null,null,null,"Datos a grabar en el paso 2 de ECOGAN",null,null,null,null,null,"Datos a grabar en el paso 4 de ECOGAN"]
[null,null,null,null,null,null,null," ",null,null,null,null,null,null,null,null,"nº total de animales que entran de esta categoría productiva:",{"$f":"AE160","v":0},null,null,null,null,"Periodo productivo total medio de la categoría productiva:",{"$f":"H4","v":0}]
["Categoría productiva: ",null,null,"Mamones Macho procedentes de vacas lecheras",null,null,null,null,null,null,null,null,null,null,null,null,"nº total de animales vivos que finalizan de esta categoría productiva:",{"$f":"AF160","v":0},null,null,null,null,"días medios presentes de la categoría productiva:",{"$f":"AR160","v":0}]
[null,null,null,null,null,"Indique el periodo productivo medio de la categoría productiva (días):",null,null,"*"]
[null,null,null,null,null,"Periodo productivo medio de referencia (días):",null,{"$f":"IFERROR(VLOOKUP(D3,Base!A2:B7,2,FALSE),\"sin dato\")","v":346},{"$f":"IF(H5=\"sin dato\",\"\",\"(\"&ROUND(H5*0.9,0) &\" - \"&ROUND(H5*1.1,0)&\")\")","v":"(311 - 381)"},null,null,null,null,"Si desea borrar datos grabados anteriormente, pulse aquí\n¡Cuidado! Perderá toda la información"]
["*","Número de días que por término medio los animales de una linea productiva permanecen en la granja desde que entran hasta que salen de ese alojamiento, de modo que el periodo es por ciclo productivo y no por año natural. "]
[null,null,null,null,null,null,null,null,null,null,null,null,{"$f":"Base!F2","v":45292},{"$f":"Base!H3","v":46387}]
["u","Lote es el grupo de animales que van entrando de forma escalonada a los corrales.",null,null,null,null,null,null,null,null,null,null,"Diagrama de entradas y salidas"]
{"$rows_left_out":153}
{"sheet":"Categoria 2","index":4,"n_rows":160,"n_cols":45,"rows_kept":160,"cut":false,"hidden":false,"merged":[[7,1,7,8],[7,12,7,24],[4,13,4,17],[0,1,0,3],[2,0,2,2],[2,3,2,8],[5,1,5,8],[0,12,0,17],[0,18,0,23]]}
[null,"Año de declaración: ",null,null,null,{"$f":"Base!B12","v":2025},null,null,null,null,null,null,"Datos a grabar en el paso 2 de ECOGAN",null,null,null,null,null,"Datos a grabar en el paso 4 de ECOGAN"]
[null,null,null,null,null,null,null,null,null,null,null,null,null,null,null,null,"nº total de animales que entran de esta categoría productiva:",{"$f":"AE160","v":0},null,null,null,null,"Periodo productivo total medio de la categoría productiva:",{"$f":"H4","v":0}]
["Categoría productiva: ",null,null,"Mamones Hembra procedentes de vacas lecheras",null,null,null,null,null,null,null,null,null,null,null,null,"nº total de animales vivos que finalizan de esta categoría productiva:",{"$f":"AF160","v":0},null,null,null,null,"días medios presentes de la categoría productiva:",{"$f":"AR160","v":0}]
[null,null,null,null,null,"Indique el periodo productivo medio de la categoría productiva (días):",null,null,"*"]
[null,null,null,null,null,"Periodo productivo medio de referencia (días):",null,{"$f":"IFERROR(VLOOKUP(D3,Base!A2:B7,2,FALSE),\"sin dato\")","v":337},{"$f":"IF(H5=\"sin dato\",\"\",\"(\"&ROUND(H5*0.9,0) &\" - \"&ROUND(H5*1.1,0)&\")\")","v":"(303 - 371)"},null,null,null,null,"Si desea borrar datos grabados anteriormente, pulse aquí\n¡Cuidado! Perderá toda la información"]
["*","Número de días que por término medio los animales de una linea productiva permanecen en la granja desde que entran hasta que salen de ese alojamiento, de modo que el periodo es por ciclo productivo y no por año natural. "]
[null,null,null,null,null,null,null,null,null,null,null,null,{"$f":"Base!F2","v":45292},{"$f":"Base!H3","v":46387}]
["u","Lote es el grupo de animales que van entrando de forma escalonada a los corrales.",null,null,null,null,null,null,null,null,null,null,"Diagrama de entradas y salidas"]
{"$rows_left_out":153}
{"sheet":"Categoria 3","index":5,"n_rows":160,"n_cols":45,"rows_kept":160,"cut":false,"hidden":false,"merged":[[7,1,7,8],[7,12,7,24],[4,13,4,17],[0,1,0,3],[2,0,2,2],[2,3,2,8],[5,1,5,8],[0,12,0,17],[0,18,0,23]]}
[null,"Año de declaración: ",null,null,null,{"$f":"Base!B12","v":2025},null,null,null,null,null,null,"Datos a grabar en el paso 2 de ECOGAN",null,null,null,null,null,"Datos a grabar en el paso 4 de ECOGAN"]
[null,null,null,null,null,null,null,null,null,null,null,null,null,null,null,null,"nº total de animales que entran de esta categoría productiva:",{"$f":"AE160","v":0},null,null,null,null,"Periodo productivo total medio de la categoría productiva:",{"$f":"H4","v":0}]
["Categoría productiva: ",null,null,"Mamones Macho procedentes de vacas nodriza",null,null,null,null,null,null,null,null,null,null,null,null,"nº total de animales vivos que finalizan de esta categoría productiva:",{"$f":"AF160","v":0},null,null,null,null,"días medios presentes de la categoría productiva:",{"$f":"AR160","v":0}]
[null,null,null,null,null,"Indique el periodo productivo medio de la categoría productiva (días):",null,null,"*"]
[null,null,null,null,null,"Periodo productivo medio de referencia (días):",null,{"$f":"IFERROR(VLOOKUP(D3,Base!A2:B7,2,FALSE),\"sin dato\")","v":346},{"$f":"IF(H5=\"sin dato\",\"\",\"(\"&ROUND(H5*0.9,0) &\" - \"&ROUND(H5*1.1,0)&\")\")","v":"(311 - 381)"},null,null,null,null,"Si desea borrar datos grabados anteriormente, pulse aquí\n¡Cuidado! Perderá toda la información"]
["*","Número de días que por término medio los animales de una linea productiva permanecen en la granja desde que entran hasta que salen de ese alojamiento, de modo que el periodo es por ciclo productivo y no por año natural. "]
[null,null,null,null,null,null,null,null,null,null,null,null,{"$f":"Base!F2","v":45292},{"$f":"Base!H3","v":46387}]
["u","Lote es el grupo de animales que van entrando de forma escalonada a los corrales.",null,null,null,null,null,null,null,null,null,null,"Diagrama de entradas y salidas"]
{"$rows_left_out":153}
{"sheet":"Categoria 4","index":6,"n_rows":160,"n_cols":45,"rows_kept":160,"cut":false,"hidden":false,"merged":[[7,1,7,8],[7,12,7,24],[4,13,4,17],[0,1,0,3],[2,0,2,2],[2,3,2,8],[5,1,5,8],[0,12,0,17],[0,18,0,23]]}
[null,"Año de declaración: ",null,null,null,{"$f":"Base!B12","v":2025},null,null,null,null,null,null,"Datos a grabar en el paso 2 de ECOGAN",null,null,null,null,null,"Datos a grabar en el paso 4 de ECOGAN"]
[null,null,null,null,null,null,null,null,null,null,null,null,null,null,null,null,"nº total de animales que entran de esta categoría productiva:",{"$f":"AE160","v":0},null,null,null,null,"Periodo productivo total medio de la categoría productiva:",{"$f":"H4","v":0}]
["Categoría productiva: ",null,null,"Mamones Hembra procedentes de vacas nodriza",null,null,null,null,null,null,null,null,null,null,null,null,"nº total de animales vivos que finalizan de esta categoría productiva:",{"$f":"AF160","v":0},null,null,null,null,"días medios presentes de la categoría productiva:",{"$f":"AR160","v":0}]
[null,null,null,null,null,"Indique el periodo productivo medio de la categoría productiva (días):",null,null,"*"]
[null,null,null,null,null,"Periodo productivo medio de referencia (días):",null,{"$f":"IFERROR(VLOOKUP(D3,Base!A2:B7,2,FALSE),\"sin dato\")","v":337},{"$f":"IF(H5=\"sin dato\",\"\",\"(\"&ROUND(H5*0.9,0) &\" - \"&ROUND(H5*1.1,0)&\")\")","v":"(303 - 371)"},null,null,null,null,"Si desea borrar datos grabados anteriormente, pulse aquí\n¡Cuidado! Perderá toda la información"]
["*","Número de días que por término medio los animales de una linea productiva permanecen en la granja desde que entran hasta que salen de ese alojamiento, de modo que el periodo es por ciclo productivo y no por año natural. "]
[null,null,null,null,null,null,null,null,null,null,null,null,{"$f":"Base!F2","v":45292},{"$f":"Base!H3","v":46387}]
["u","Lote es el grupo de animales que van entrando de forma escalonada a los corrales.",null,null,null,null,null,null,null,null,null,null,"Diagrama de entradas y salidas"]
{"$rows_left_out":153}
{"sheet":"Categoria 5","index":7,"n_rows":160,"n_cols":46,"rows_kept":160,"cut":false,"hidden":false,"merged":[[7,1,7,8],[7,12,7,24],[4,13,4,17],[0,1,0,3],[2,3,2,8],[2,0,2,2],[5,1,5,8],[0,12,0,17],[0,18,0,23]]}
[null,"Año de declaración: ",null,null,null,{"$f":"Base!B12","v":2025},null,null,null,null,null,null,"Datos a grabar en el paso 2 de ECOGAN",null,null,null,null,null,"Datos a grabar en el paso 4 de ECOGAN"]
[null,null,null,null,null,null,null,null,null,null,null,null,null,null,null,null,"nº total de animales que entran de esta categoría productiva:",{"$f":"AE160","v":0},null,null,null,null,"Periodo productivo total medio de la categoría productiva:",{"$f":"H4","v":0}]
["Categoría productiva: ",null,null,"Pasteros Macho procedentes de vacas nodriza",null,null,null,null,null,null,null,null,null,null,null,null,"nº total de animales vivos que finalizan de esta categoría productiva:",{"$f":"AF160","v":0},null,null,null,null,"días medios presentes de la categoría productiva:",{"$f":"AR160","v":0}]
[null,null,null,null,null,"Indique el periodo productivo medio de la categoría productiva (días):",null,null,"*"]
[null,null,null,null,null,"Periodo productivo medio de referencia (días):",null,{"$f":"IFERROR(VLOOKUP(D3,Base!A2:B7,2,FALSE),\"sin dato\")","v":185},{"$f":"IF(H5=\"sin dato\",\"\",\"(\"&ROUND(H5*0.9,0) &\" - \"&ROUND(H5*1.1,0)&\")\")","v":"(167 - 204)"},null,null,null,null,"Si desea borrar datos grabados anteriormente, pulse aquí\n¡Cuidado! Perderá toda la información"]
["*","Número de días que por término medio los animales de una linea productiva permanecen en la granja desde que entran hasta que salen de ese alojamiento, de modo que el periodo es por ciclo productivo y no por año natural. "]
[null,null,null,null,null,null,null,null,null,null,null,null,{"$f":"Base!F2","v":45292},{"$f":"Base!H3","v":46387}]
["u","Lote es el grupo de animales que van entrando de forma escalonada a los corrales.",null,null,null,null,null,null,null,null,null,null,"Diagrama de entradas y salidas"]
{"$rows_left_out":153}
{"sheet":"Categoria 6","index":8,"n_rows":160,"n_cols":45,"rows_kept":160,"cut":false,"hidden":false,"merged":[[7,1,7,8],[7,12,7,24],[4,13,4,17],[0,1,0,3],[2,0,2,2],[2,3,2,8],[5,1,5,8],[0,12,0,17],[0,18,0,23]]}
[null,"Año de declaración: ",null,null,null,{"$f":"Base!B12","v":2025},null,null,null,null,null,null,"Datos a grabar en el paso 2 de ECOGAN",null,null,null,null,null,"Datos a grabar en el paso 4 de ECOGAN"]
[null,null,null,null,null,null,null,null,null,null,null,null,null,null,null,null,"nº total de animales que entran de esta categoría productiva:",{"$f":"AE160","v":0},null,null,null,null,"Periodo productivo total medio de la categoría productiva:",{"$f":"H4","v":0}]
["Categoría productiva: ",null,null,"Pasteros Hembra procedentes de vacas nodriza",null,null,null,null,null,null,null,null,null,null,null,null,"nº total de animales vivos que finalizan de esta categoría productiva:",{"$f":"AF160","v":0},null,null,null,null,"días medios presentes de la categoría productiva:",{"$f":"AR160","v":0}]
[null,null,null,null,null,"Indique el periodo productivo medio de la categoría productiva (días):",null,null,"*"]
[null,null,null,null,null,"Periodo productivo medio de referencia (días):",null,{"$f":"IFERROR(VLOOKUP(D3,Base!A2:B7,2,FALSE),\"sin dato\")","v":165},{"$f":"IF(H5=\"sin dato\",\"\",\"(\"&ROUND(H5*0.9,0) &\" - \"&ROUND(H5*1.1,0)&\")\")","v":"(149 - 182)"},null,null,null,null,"Si desea borrar datos grabados anteriormente, pulse aquí\n¡Cuidado! Perderá toda la información"]
["*","Número de días que por término medio los animales de una linea productiva permanecen en la granja desde que entran hasta que salen de ese alojamiento, de modo que el periodo es por ciclo productivo y no por año natural. "]
[null,null,null,null,null,null,null,null,null,null,null,null,{"$f":"Base!F2","v":45292},{"$f":"Base!H3","v":46387}]
["u","Lote es el grupo de animales que van entrando de forma escalonada a los corrales.",null,null,null,null,null,null,null,null,null,null,"Diagrama de entradas y salidas"]
{"$rows_left_out":153}
{"sheet":"Categoria 7","index":9,"n_rows":160,"n_cols":45,"rows_kept":160,"cut":false,"hidden":false,"merged":[[7,1,7,8],[7,12,7,24],[4,13,4,17],[0,1,0,3],[2,0,2,2],[2,3,2,8],[5,1,5,8],[0,12,0,17],[0,18,0,23]]}
[null,"Año de declaración: ",null,null,null,{"$f":"Base!B12","v":2025},null,null,null,null,null,null,"Datos a grabar en el paso 2 de ECOGAN",null,null,null,null,null,"Datos a grabar en el paso 4 de ECOGAN"]
[null,null,null,null,null,null,null,null,null,null,null,null,null,null,null,null,"nº total de animales que entran de esta categoría productiva:",{"$f":"AE160","v":0},null,null,null,null,"Periodo productivo total medio de la categoría productiva:",{"$f":"H4","v":0}]
["Categoría productiva: ",null,null,"Hembras adultas de descarte o desvieje",null,null,null,null,null,null,null,null,null,null,null,null,"nº total de animales vivos que finalizan de esta categoría productiva:",{"$f":"AF160","v":0},null,null,null,null,"días medios presentes de la categoría productiva:",{"$f":"AR160","v":0}]
[null,null,null,null,null,"Indique el periodo productivo medio de la categoría productiva (días):",null,null,"*"]
[null,null,null,null,null,"Periodo productivo medio de referencia (días):",null,{"$f":"IFERROR(VLOOKUP(D3,Base!A2:B7,2,FALSE),\"sin dato\")","v":"sin dato"},{"$f":"IF(H5=\"sin dato\",\"\",\"(\"&ROUND(H5*0.9,0) &\" - \"&ROUND(H5*1.1,0)&\")\")","v":""},null,null,null,null,"Si desea borrar datos grabados anteriormente, pulse aquí\n¡Cuidado! Perderá toda la información"]
["*","Número de días que por término medio los animales de una linea productiva permanecen en la granja desde que entran hasta que salen de ese alojamiento, de modo que el periodo es por ciclo productivo y no por año natural. "]
[null,null,null,null,null,null,null,null,null,null,null,null,{"$f":"Base!F2","v":45292},{"$f":"Base!H3","v":46387}]
["u","Lote es el grupo de animales que van entrando de forma escalonada a los corrales.",null,null,null,null,null,null,null,null,null,null,"Diagrama de entradas y salidas"]
{"$rows_left_out":153}
{"sheet":"Categoria 8","index":10,"n_rows":160,"n_cols":45,"rows_kept":160,"cut":false,"hidden":false,"merged":[[7,1,7,8],[7,12,7,24],[4,13,4,17],[0,1,0,3],[2,0,2,2],[2,3,2,8],[5,1,5,8],[0,12,0,17],[0,18,0,23]]}
[null,"Año de declaración: ",null,null,null,{"$f":"Base!B12","v":2025},null,null,null,null,null,null,"Datos a grabar en el paso 2 de ECOGAN",null,null,null,null,null,"Datos a grabar en el paso 4 de ECOGAN"]
[null,null,null,null,null,null,null,null,null,null,null,null,null,null,null,null,"nº total de animales que entran de esta categoría productiva:",{"$f":"AE160","v":0},null,null,null,null,"Periodo productivo total medio de la categoría productiva:",{"$f":"H4","v":0}]
["Categoría productiva: ",null,null,"Cebones/Bueyes/Sementales de desvieje",null,null,null,null,null,null,null,null,null,null,null,null,"nº total de animales vivos que finalizan de esta categoría productiva:",{"$f":"AF160","v":0},null,null,null,null,"días medios presentes de la categoría productiva:",{"$f":"AR160","v":0}]
[null,null,null,null,null,"Indique el periodo productivo medio de la categoría productiva (días):",null,null,"*",null,null,null,null,null,null,null,null,null,null,null,null,null,null,{"$f":"IF(X3>X2,\"Los días medios presentes no deben superar el periodo productivo total medio. Revise que no haya casillas sombreadas en amarillo en la fecha de finalización de los lotes\",\"\")","v":""}]
[null,null,null,null,null,"Periodo productivo medio de referencia (días):",null,{"$f":"IFERROR(VLOOKUP(D3,Base!A2:B7,2,FALSE),\"sin dato\")","v":"sin dato"},{"$f":"IF(H5=\"sin dato\",\"\",\"(\"&ROUND(H5*0.9,0) &\" - \"&ROUND(H5*1.1,0)&\")\")","v":""},null,null,null,null,"Si desea borrar datos grabados anteriormente, pulse aquí\n¡Cuidado! Perderá toda la información"]
["*","Número de días que por término medio los animales de una linea productiva permanecen en la granja desde que entran hasta que salen de ese alojamiento, de modo que el periodo es por ciclo productivo y no por año natural. "]
[null,null,null,null,null,null,null,null,null,null,null,null,{"$f":"Base!F2","v":45292},{"$f":"Base!H3","v":46387}]
["u","Lote es el grupo de animales que van entrando de forma escalonada a los corrales.",null,null,null,null,null,null,null,null,null,null,"Diagrama de entradas y salidas"]
{"$rows_left_out":152}